View topic - Yet another building's problem

Yet another building's problem

Users-contributed CVS development builds. Post here your questions about compiling the source code.

Yet another building's problem

Post Sat Jun 06, 2009 11:38 am

Hello:

I was trying to build yafaray with Scons v 1.2.0
I have installed all the required libraries.
I paste the last lines before the error:

Code: Select all
g++ -o build/yafraycore/object3d.os -c -Wall -fPIC -O3 -ffast-math -DHAVE_PTHREAD -DHAVE_EXR -DHAVE_XML -DHAVE_JPEG -DHAVE_PNG -DHAVE_ZLIB -DHAVE_FREETYPE -DBUILDING_YAFRAYCORE -I. -Iinclude -I/usr/include/OpenEXR -I/usr/include/libxml2 -I/usr/include/freetype2 src/yafraycore/object3d.cc
In file included from include/yafraycore/meshtypes.h:7,
                 from src/yafraycore/object3d.cc:2:
include/yafraycore/vmap.h:9:18: error: half.h: No such file or directory
In file included from include/yafraycore/meshtypes.h:7,
                 from src/yafraycore/object3d.cc:2:
include/yafraycore/vmap.h:28: error: 'half' was not declared in this scope
include/yafraycore/vmap.h:28: error: template argument 1 is invalid
include/yafraycore/vmap.h:28: error: template argument 2 is invalid
scons: *** [build/yafraycore/object3d.os] Error 1
scons: building terminated because of errors.


Anyone can help me?

P.S. I have Slackware 12.1 OS
P.S.2. Sorry for my english
---Under construction---
sybill
 
Posts: 18
Joined: Tue Sep 12, 2006 9:42 pm
Location: Spain

Re: Yet another building's problem

Post Thu Jun 11, 2009 10:03 pm

I feel so alone.... :|
---Under construction---
sybill
 
Posts: 18
Joined: Tue Sep 12, 2006 9:42 pm
Location: Spain

Re: Yet another building's problem

Post Sat Jun 13, 2009 2:18 pm

have you openexr dev files?
paulo_gomes
 
Posts: 85
Joined: Fri Jun 24, 2005 6:55 pm
Location: Portugal

Re: Yet another building's problem

Post Thu Jun 25, 2009 4:56 pm

Thank you very very much, paulo_gomes. I hadn't openexr dev files.
It was the problem ;-)
---Under construction---
sybill
 
Posts: 18
Joined: Tue Sep 12, 2006 9:42 pm
Location: Spain

Re: Yet another building's problem

Post Wed Dec 16, 2009 10:22 am

Hello!
I have the same problem. Where to find openexr dev files?
Help, please!
Thanks.
pipec
 
Posts: 1
Joined: Wed Dec 16, 2009 10:18 am

Re: Yet another building's problem

Post Wed Dec 16, 2009 12:47 pm

It may depend on which operating system you use, but you probably need to install something like libopenexr-dev
User avatar
stoneage
 
Posts: 1241
Joined: Sun Dec 23, 2007 1:06 pm


Return to Testing Builds



Who is online

Users browsing this forum: No registered users and 3 guests

cron